Uploaded image for project: 'Integration'
  1. Integration
  2. INT-344

All R1 AAI Model-loader jenkins jobs BUILD FAILURE since 16 nov on missing sdc-distribution-client 1.1.32 - should be 1.1.50

    Details

    • Type: Bug
    • Status: Closed
    • Priority: Medium
    • Resolution: Done
    • Affects Version/s: None
    • Fix Version/s: None
    • Component/s: None

      Description

      https://jenkins.onap.org/view/aai/job/aai-model-loader-master-aai-docker-java-daily/

      It looks like our branching artifact move is still in progress for 1.1.0 

      Build failed to find artifact org.openecomp.sdc.sdc-distribution-client:sdc-distribution-client:jar:1.1.32-SNAPSHOT needed for sub-project org.onap.aai.model-loader:model-loader:jar:1.1.0-SNAPSHOT. Check correct groupId, artifactId and version. This may also indicate a problem with nexus. Another possibility is that this is a -SNAPSHOT version and it has expired from nexus -- in that case check with the project which provides the artifact.
      Indication 1 
      
      12:25:22 [INFO] ------------------------------------------------------------------------
      12:25:22 [INFO] BUILD FAILURE
      12:25:22 [INFO] ------------------------------------------------------------------------
      12:25:22 [INFO] Total time: 51.600 s
      12:25:22 [INFO] Finished at: 2017-11-23T12:25:22+00:00
      12:25:22 [INFO] Final Memory: 30M/530M
      12:25:22 [INFO] ------------------------------------------------------------------------
      12:25:22 [ERROR] Failed to execute goal on project model-loader: Could not resolve dependencies for project org.onap.aai.model-loader:model-loader:jar:1.1.0-SNAPSHOT: Could not find artifact org.openecomp.sdc.sdc-distribution-client:sdc-distribution-client:jar:1.1.32-SNAPSHOT in ecomp-snapshots (https://nexus.onap.org/content/repositories/snapshots/) -> [Help 1]
      12:25:22 [ERROR] 
      12:25:22 [ERROR] To see the full stack trace of the errors, re-run Maven with the -e switch.
      12:25:22 [ERROR] Re-run Maven using the -X switch to enable full debug logging.
      12:25:22 [ERROR] 
      12:25:22 [ERROR] For more information about the errors and possible solutions, please read the following articles:
      12:25:22 [ERROR] [Help 1] http://cwiki.apache.org/confluence/display/MAVEN/DependencyResolutionException

        Attachments

          Issue Links

          No reviews matched the request. Check your Options in the drop-down menu of this sections header.

            Activity

              People

              • Assignee:
                helenc878 Helen Chen
                Reporter:
                michaelobrien Michael O'Brien
              • Votes:
                0 Vote for this issue
                Watchers:
                3 Start watching this issue

                Dates

                • Created:
                  Updated:
                  Resolved: