Uploaded image for project: 'Microservices Bus'
  1. Microservices Bus
  2. MSB-70

Swagger SDK site job build failed

    XMLWordPrintable

    Details

    • Type: Bug
    • Status: Closed
    • Priority: Medium
    • Resolution: Done
    • Affects Version/s: Amsterdam Release
    • Fix Version/s: Amsterdam Release
    • Labels:
      None
    • Sprint:
      MSB Sprint 5

      Description

      [ERROR] Failed to execute goal org.apache.maven.plugins:maven-site-plugin:3.6:stage-deploy (default-cli) on project swagger-sdk: Missing site information in the distribution management of the project swagger-sdk (org.onap.msb.swagger-sdk:swagger-sdk:1.0.0) -> [Help 1]
      [ERROR]
      [ERROR] To see the full stack trace of the errors, re-run Maven with the -e switch.
      [ERROR] Re-run Maven using the -X switch to enable full debug logging.
      [ERROR]
      [ERROR] For more information about the errors and possible solutions, please read the following articles:
      [ERROR] [Help 1] http://cwiki.apache.org/confluence/display/MAVEN/MojoExecutionException
      Build step 'Invoke top-level Maven targets' marked build as failure

        Attachments

        No reviews matched the request. Check your Options in the drop-down menu of this sections header.

          Activity

            People

            Assignee:
            HuabingZhao HuabingZhao
            Reporter:
            HuabingZhao HuabingZhao
            Votes:
            0 Vote for this issue
            Watchers:
            1 Start watching this issue

              Dates

              Created:
              Updated:
              Resolved: